{"text_format":"1","workbook":"xlsx","n_sheets":9,"sheets":["Instructions","Input sheet","Validate","Validation summary page","ChangeLog","Summary counts","lists","Change Log","Formula"],"not_rendered":{"charts":0,"images":0,"macros":1,"external_links":1,"defined_names":131,"comments":0,"pivot_tables":0},"unopened":[],"bounds":{"document_bytes":16777216,"sheet_cells":100000,"rows_first":2000,"rows_last":500,"rows_between":2000,"halvings":0,"cell_chars":16384,"cell_head_chars":4096},"cells_cut":0,"cells_raw":0,"read":"whole","date_system":"1900"}

{"sheet":"Instructions","index":0,"n_rows":30,"n_cols":12,"rows_kept":30,"cut":false,"hidden":false,"merged":[[18,5,18,6]]}
[]
[null,"Adult Social Care - Client Level Data Collection (ASC-CLD): Validation Tool"]
[]
[null,"The CLD Validation tool is experimental (beta) and we welcome all feedback for future development:",null,null,null,null,null,null,null,"agem.adultsocialcare@nhs.net"]
[null,null,null,null,null,null,null,null,"Validation Tool  V2.14",null,null,"20th April 2026"]
[null,"Version:","Release 2"]
[null,"Please use this tool to help validate the CLD data before submission to the DSCRO."]
[null,"This tool is compatible with Excel 2021 and later."]
[]
[null,"HOW TO: Steps to validate"]
{"$rows_left_out":21}
{"sheet":"Input sheet","index":1,"n_rows":11,"n_cols":52,"rows_kept":11,"cut":false,"hidden":false,"merged":[[7,45,8,45],[7,46,8,46],[7,47,8,47],[5,3,5,21],[5,23,5,28],[5,38,5,41],[5,45,5,47],[7,19,8,19],[7,20,8,20],[7,41,8,41],[7,42,8,42],[7,24,8,24],[5,42,5,44],[5,30,5,32],[7,38,8,38],[7,34,8,34],[3,1,3,3],[7,1,8,1],[7,2,8,2],[7,6,8,6],[7,3,8,3],[6,48,7,48],[7,49,7,51],[7,4,8,4],[7,16,8,16],[7,26,8,26],[7,27,8,27],[7,32,8,32],[7,30,8,30],[7,31,8,31],[7,39,8,39],[7,40,8,40],[7,35,8,35],[7,36,8,36],[7,37,8,37],[7,17,8,17],[7,18,8,18],[7,0,8,0],[0,0,0,4],[7,23,8,23],[5,0,5,2],[7,22,8,22],[7,11,8,11],[7,12,8,12],[7,13,8,13],[7,7,8,7],[7,8,8,8],[7,9,8,9],[7,10,8,10],[7,5,8,5],[7,14,8,14],[7,15,8,15],[2,1,2,3],[7,44,8,44],[7,43,8,43],[7,25,8,25],[7,21,8,21],[7,28,8,28],[7,29,8,29],[7,33,8,33]]}
["Adult Social Care - Client Level Data (CLD) - INPUT SHEET",null,null,null,null,null,"Spec Version"]
[null,"Mandatory","Voluntary","Remove?"]
["Summary:","Count of total data items"]
[null,{"$f":"COUNTIF(A8:AV8,\"*\")","v":48}]
[null,"IMPORTANT: Cells highlighted red contain the validation formula (columns AY:BB) - DO NOT DELETE"]
["Submission Information",null,null,"Person Details - Present on ALL rows with unique values for each data item repeated for all events relating to a person (NOT event specific)",null,null,null,null,null,null,null,null,null,null,null,null,null,null,null,null,null,null,null,"Events (All)",null,null,null,null,null,"Events (Requests only)","Events (Assessments only)",null,null,"Carers and linked service users (Carers only)",null,null,null,null,"Events (Services only)",null,null,null,"Events (Reviews only)",null,null,"Costs (Services Only)"]
["Mandatory","Mandatory","Mandatory","Mandatory","Mandatory","Mandatory","Mandatory","Voluntary","Mandatory","Mandatory","Mandatory","Mandatory","Mandatory","Mandatory","Mandatory","Mandatory","Mandatory","Voluntary","Voluntary","Voluntary","Voluntary","Mandatory","Voluntary","Mandatory","Mandatory","Voluntary","Mandatory","Mandatory","Mandatory","Voluntary","Voluntary","Mandatory","Mandatory","Voluntary","Voluntary","Mandatory","Voluntary","Voluntary","Voluntary","Voluntary","Voluntary",null,null,null,"Mandatory",null,null,null,"Auto populated"]
["LA Code","Reporting Period Start Date","Reporting Period End Date","NHS Number","LA Person Unique Identifier","First Name","Last Name","GP Practice Code","Gender","Ethnicity","Date of Birth","Date of Death","Client Type","Primary Support Reason","Postcode","Accommodation Status","Employment Status","Has Unpaid Carer","Autism Spectrum Disorder (ASD)","Visual Impairment","Hearing Impairment","Dementia","Client Funding Status","Event Type","Event Reference","Event Start Date","Event End Date","Event Description","Event Outcome","Request: Route of Access","Assessment Type","Eligible Needs Identified","Method of Assessment","Total Hrs Caring per week","No. of adults being cared for","Adult 1 Linked Person_ID","Adult 2 Linked Person_ID","Adult 3 Linked Person_ID","Service Type","Service Component","Delivery Mechanism","Provider CQC Location ID","Review Reason","Review Outcomes Achieved","Method of Review","Unit Cost","Cost Frequency (Unit Type)","Planned units per week",null,"Do not remove"]
[null,null,null,null,null,null,null,null,null,null,null,null,null,null,null,null,null,null,null,null,null,null,null,null,null,null,null,null,null,null,null,null,null,null,null,null,null,null,null,null,null,null,null,null,null,null,null,null,"Planned cost\nfull year\n\nSubmission year","Commitment dates"]
["Integer","dd/mm/yyyy","dd/mm/yyyy","Integer ","Integer or Alpha-numeric","Text","Text","Alpha-numeric","Defined List…","Defined List…","dd/mm/yyyy","dd/mm/yyyy","Defined List","Defined List…","Alpha-numeric","Defined List…","Defined List…","Defined List…","Defined List…","Defined List","Defined List","Defined List…","Defined List…","Defined List…","Integer or Alpha-numeric","dd/mm/yyyy","dd/mm/yyyy","Text","Defined List…","Defined List…","Defined List…","Defined List…","Defined List…","Defined List","Integer","Integer or Alpha-numeric","Integer or Alpha-numeric","Integer or Alpha-numeric","Defined List…","Defined List…","Defined List…","Alpha-numeric","Defined List…","Defined List…","Defined List…","Numeric (0.00)","Defined List…","Numeric (0.00)","Year","start","end","wks"]
{"$rows_left_out":2}
{"sheet":"Validate","index":2,"n_rows":11,"n_cols":104,"rows_kept":11,"cut":false,"hidden":false,"merged":[[6,45,6,47],[6,0,6,2],[0,0,0,4],[6,3,6,21],[6,23,6,28],[6,38,6,41],[6,30,6,32],[6,42,6,44]]}
["Adult Social Care - Client Level Data (CLD) - VALIDATE",null,null,null,null,null,"Spec Version","Release 2"]
[]
[]
[]
[]
[null,"IMPORTANT: Cells highlighted red contain the validation formula (row 11) - DO NOT DELETE "]
["Submission Information",null,null,"Person Details - Present on ALL rows with unique values for each data item repeated for all events relating to a person (NOT event specific)",null,null,null,null,null,null,null,null,null,null,null,null,null,null,null,null,null,null,null,"Events (All)",null,null,null,null,null,"Events (Requests only)","Events (Assessments only)",null,null,"Carers and linked service users (Carers only)",null,null,null,null,"Events (Services only)",null,null,null,"Events (Reviews only)",null,null,"Costs (Services Only)"]
["Mandatory","Mandatory","Mandatory","Mandatory","Mandatory","Mandatory","Mandatory","Voluntary","Mandatory","Mandatory","Mandatory","Mandatory","Mandatory","Mandatory","Mandatory","Mandatory","Mandatory","Voluntary","Voluntary","Voluntary","Voluntary","Mandatory","Voluntary","Mandatory","Mandatory","Voluntary","Mandatory","Mandatory","Mandatory","Voluntary","Voluntary","Mandatory","Mandatory","Voluntary","Voluntary","Mandatory","Voluntary","Voluntary","Voluntary","Voluntary",null,null,null,null,"Mandatory",null,null,"Voluntary"]
[null,null,null,null,null,null,null,null,null,null,null,null,null,null,null,null,null,null,null,null,null,null,null,null,null,null,null,null,null,null,null,null,null,null,null,null,null,null,null,null,null,null,null,null,null,null,null,null,null,"LA Code ","Reporting Period Start Date","Reporting Period End Date","NHS Number","LA Person Unique Identifier","First Name","Last Name","GP Practice Code","Gender","Ethnicity","Date of Birth","Date of Death","Client Type","Primary Support Reason","Postcode","Accommodation Status","Employment Status","Has Unpaid Carer","Autism Spectrum Disorder (ASD)","Visual Impairment","Hearing Impairment","Dementia","Client Funding Status","Event Type","Event Reference","Event Start Date","Event End Date","Event Description","Event Outcome","Request: Route of Access","Assessment Type","Eligible Needs Identified","Method of Assessment","Total Hrs Caring per week","No. of adults being cared for","Adult 1 Linked Person_ID","Adult 2 Linked Person_ID","Adult 3 Linked Person_ID","Service Type","Service Component","Delivery Mechanism","Provider CQC Location ID","Review Reason","Review Outcomes Achieved","Method of Review","Unit Cost","Cost Frequency (Unit Type)","Planned units per week"]
["LA Code","Reporting Period Start Date","Reporting Period End Date","NHS Number","LA Person Unique Identifier","First Name","Last Name","GP Practice Code","Gender","Ethnicity","Date of Birth","Date of Death","Client Type","Primary Support Reason","Postcode","Accommodation Status","Employment Status","Has Unpaid Carer","Autism Spectrum Disorder (ASD)","Visual Impairment","Hearing Impairment","Dementia","Client Funding Status","Event Type","Event Reference","Event Start Date","Event End Date","Event Description","Event Outcome","Request: Route of Access","Assessment Type","Eligible Needs Identified","Method of Assessment","Total Hrs Caring per week","No. of adults being cared for","Adult 1 Linked Person_ID","Adult 2 Linked Person_ID","Adult 3 Linked Person_ID","Service Type","Service Component","Delivery Mechanism","Provider CQC Location ID","Review Reason","Review Outcomes Achieved","Method of Review","Unit Cost","Cost Frequency (Unit Type)","Planned units per week",null,"Column A","Column B","Column  C","Column  D","Column  E","Column F","Column G","Column H","Column I","Column J","Column K","Column L","Column M","Column N","Column O","Column P","Column Q","Column R","Column S","Column T","Column U","Column V","Column W","Column X","Column Y","Column Z","Column AA","Column AB","Column AC","Column AD","Column AE","Column AF","Column AG","Column AH","Column AI","Column AJ","Column AK","Column AL","Column AM","Column AN","Column AO","Column AP","Column AQ","Column AR","Column AS","Column AT","Column AU","Column AV",null,"Age\n\nat end date of reporting period","Age Band\n\non end date of event","LTS005","Event active during submission period","Row Validated = P\nELSE\nValidation count","Acceptable by DLP"]
{"$rows_left_out":2}
{"sheet":"Validation summary page","index":3,"n_rows":150,"n_cols":8,"rows_kept":150,"cut":false,"hidden":false,"merged":[[2,1,2,6],[16,1,16,6],[0,0,0,6],[5,1,5,7]]}
["Adult Social Care - Client Level Data (CLD): Validation Summary"]
[]
[null,"Validation rules apply for to both mandatory and voluntary data items that LAs have supplied data for."]
[null,"If LAs have not supplied data for the voluntary data items then the validation rules will not apply."]
[]
[null,"Summary of all primary validation rules"]
[]
[null,"Validation Type","No. of validation  rules","No. of items\ntriggered"]
[null,"Missing Value",{"$f":"COUNTIF(E:E,B9)","v":33},{"$f":"SUM(G20:G52)","v":0},{"$f":"IF(Validate!$A$11=\"\",\"\",IF(D9=0,\"PASS\",\"CHECK\"))","v":""},"Total rows that have passed validation",{"$f":"COUNTIF(Validate!CY:CY,\"P\")","v":0},"P"]
[null,"Restricted Length",{"$f":"COUNTIF(E:E,B10)","v":37},{"$f":"SUM(G53:G89)","v":0},{"$f":"IF(Validate!$A$11=\"\",\"\",IF(D10=0,\"PASS\",\"CHECK\"))","v":""},"Total rows with at least one validation rule triggered",{"$f":"COUNTIF(Validate!CY:CY,\">=1\")","v":0}]
{"$rows_left_out":141}
{"sheet":"ChangeLog","index":4,"n_rows":8,"n_cols":2,"rows_kept":8,"cut":false,"hidden":true,"merged":[]}
["Version","Change"]
[1.25,"Incorporated changelog"]
[1.25,"NHS number validation: remove P for text, check length is 10"]
[1.25,"Date columns on validate tab set to date format"]
[1.25,"Mandate on Dementia Status column removed"]
[1.25,"Summary counts on Service Component expanded"]
[1.25,"Method of Review validation altered to ES only when not review and not blank"]
[1.27,"Method of Review validation corrected"]

{"sheet":"Summary counts","index":5,"n_rows":72,"n_cols":6,"rows_kept":72,"cut":false,"hidden":false,"merged":[[0,0,0,6],[3,6,3,8]]}
["Adult Social Care - Client Level Data (CLD): Summary counts"]
[]
[]
[]
[]
[]
[null,null,"Count of events\nby Event Type"]
[null,null,"Request",{"$f":"COUNTIF('Input sheet'!X11:X999999,C8)","v":0}]
[null,null,"Assessment",{"$f":"COUNTIF('Input sheet'!X11:X999999,C9)","v":0}]
[null,null,"Service",{"$f":"COUNTIF('Input sheet'!X11:X999999,C10)","v":0}]
{"$rows_left_out":63}
{"sheet":"lists","index":6,"n_rows":142,"n_cols":58,"rows_kept":142,"cut":false,"hidden":true,"merged":[[0,37,1,37],[0,21,1,21],[0,38,1,38],[0,39,1,39],[0,40,1,40],[0,32,1,32],[0,22,1,22],[0,23,1,23],[0,24,1,24],[0,25,1,25],[0,26,1,26],[0,27,1,27],[0,28,1,28],[0,29,1,29],[0,30,1,30],[0,31,1,31],[0,33,1,33],[0,34,1,34],[0,35,1,35],[0,36,1,36],[0,6,1,6],[0,7,1,7],[0,10,1,10],[0,11,1,11],[0,20,1,20],[0,12,1,12],[0,8,1,8],[0,9,1,9],[0,18,1,18],[0,19,1,19],[0,17,1,17],[0,13,1,13],[0,14,1,14],[0,15,1,15],[0,16,1,16],[0,5,1,5],[0,0,1,0],[0,1,1,1],[0,2,1,2],[0,3,1,3],[0,4,1,4],[0,47,1,47],[1,49,1,53],[0,41,1,41],[0,42,1,42],[0,43,1,43],[0,45,1,45],[0,46,1,46],[0,44,1,44]]}
["LA Code ","Reporting Period Start Date","Reporting Period End Date","NHS Number","LA Person Unique Identifier","First Name","Last Name","GP Practice Code","Gender","Ethnicity","Date of Birth","Date of Death","Client Type","Primary Support Reason","Postcode","Accommodation Status","Employment Status","Has Unpaid Carer","Autism Spectrum Disorder (ASD)","Visual Impairment","Hearing Impairment","Dementia","Client Funding Status","Event Type","Event Reference","Event Start Date","Event End Date","Event Description","Event Outcome","Request: Route of Access","Assessment Type","Eligible Needs Identified","Method of Assessment","Total Hrs Caring per week","No. of adults being cared for","Adult 1 Linked Person_ID","Adult 2 Linked Person_ID","Adult 3 Linked Person_ID","Service Type","Service Component","Delivery Mechanism","Provider CQC Location ID","Review Reason","Review Outcomes Achieved","Method of Review","Unit Cost","Cost Frequency (Unit Type)","Planned units per week",null,null,null,null,null,null,null,null,"Age","Age Band"]
[null,null,null,null,null,null,null,null,null,null,null,null,null,null,null,null,null,null,null,null,null,null,null,null,null,null,null,null,null,null,null,null,null,null,null,null,null,null,null,null,null,null,null,null,null,null,null,null,null,"Do not move",null,null,null,null,null,null,0,"0-18"]
["Integer","dd/mm/yyyy","dd/mm/yyyy","Integer ","Integer or Alpha-numeric","Text","Text","Alpha-numeric","Defined List…","Defined List…","dd/mm/yyyy","dd/mm/yyyy","Defined List","Defined List…","Alpha-numeric","Defined List…","Defined List…","Defined List…","Defined List…","Defined List","Defined List","Defined List…","Defined List…","Defined List…","Integer or Alpha-numeric","dd/mm/yyyy","dd/mm/yyyy","Text","Defined List…","Defined List…","Defined List…","Defined List…","Defined List…","Defined List","Integer","Integer or Alpha-numeric","Integer or Alpha-numeric","Integer or Alpha-numeric","Defined List…","Defined List…","Defined List…","Alpha-numeric","Defined List…","Defined List…","Defined List…","Numeric (0.00)","Defined List…","Numeric (0.00)",null,"Cost Frequency","Cost frequency fraction",null,"Start Date  Reporting Period","End Date Reporting Period","End Date Reporting Year",null,1,"0-18"]
[null,null,null,null,null,null,null,null,"Female","Asian or Asian British: Any other Asian background",null,null,"Service user","Learning disability support","Unknown","Acute hospital or long term healthcare residential facility","Not in paid employment: Not actively seeking work or retired","Yes","Yes","Blind or severely sight impaired","Deaf with speech","Yes","Fully client funded","Request",null,null,null,null,"Admitted to hospital","Community or other route","Financial assessment","Eligible needs identified","Unpaid carer only","1 to 9 hours a week",null,null,null,null,"Unpaid carer support: Direct to unpaid carer","Extra care housing","CASSR commissioned support",null,"Review of short term support","Fully Met","Unpaid carer only",null,"4-weekly",null,null,"Defined List…",null,"2020/21, Q1","2020-04-01","2020-06-30","2021-03-31",null,2,"0-18"]
[null,null,null,null,null,null,null,null,"Male","Asian or Asian British: Bangladeshi",null,null,"Unknown","Mental health support",null,"Approved premises for offenders released from prison or under probation supervision","Not in paid employment: Seeking work","No","No","No visual impairment","Deaf without speech","No","Fully social care funded","Assessment",null,null,null,null,"Continuation of support or services","Discharge from hospital","Long term assessment","Non-eligible needs identified","Service user and unpaid carer","10 to 19 hours a week",null,null,null,null,"Unpaid carer support: Support involving the person cared-for","Unpaid carer respite","CASSR managed personal budget",null,"Planned review of long term care and support plan","Partially Met","Service user and unpaid carer",null,"Annually",null,null,"Per Session",52.14,"2020/21, Q2","2020-04-01","2020-09-30","2021-03-31",null,3,"0-18"]
[null,null,null,null,null,null,null,null,"Other","Asian or Asian British: Chinese",null,null,"Unpaid carer","Physical support: Access and mobility only",null,"Mobile accommodation for Gypsy, Roma and Traveller communities","Not in paid employment: Voluntary work only","Unknown","Unknown","Partial sight or sight impaired","Hard of hearing","Unknown","Joint client and social care funded","Service",null,null,null,null,"NFA: Deceased","Discharge from reablement","Short term assessment","No needs identified","Service user only","20 to 34 hours a week",null,null,null,null,"Long term support: Community","Unpaid carer sitting service","Direct payment",null,"Unplanned: Unpaid carer related","Not Met","Service user only",null,"Daily",null,null,"Hourly",52.14,"2020/21, Q3","2020-04-01","2020-12-31","2021-03-31",null,4,"0-18"]
[null,null,null,null,null,null,null,null,"Unknown","Asian or Asian British: Indian",null,null,"Unpaid carer known by association","Physical support: Personal care support",null,"Night shelter, emergency hostel or direct access hostel","Paid: 16 or more hours a week",null,null,"Unknown","No hearing impairment",null,"Unknown","Review",null,null,null,null,"NFA: Information and advice or signposting","Diversion from hospital services",null,null,null,"35 to 49 hours a week",null,null,null,null,"Long term support: Nursing care","Unpaid carer universal services",null,null,"Unplanned: Change in commissioning arrangements","Not applicable",null,null,"Fortnightly",null,null,"Weekly",52.14,"2020/21,Q4","2020-04-01","2021-03-31","2021-03-31",null,5,"0-18"]
[null,null,null,null,null,null,null,null,null,"Asian or Asian British: Pakistani",null,null,null,"Sensory support: Support for dual impairment",null,"Other temporary accommodation","Paid: Hours per week unknown",null,null,"Visual impairment: Severity unknown","Hearing impairment: Severity unknown",null,null,null,null,null,null,null,"NFA: No services offered for other reason","Planned transition from children’s services",null,null,null,"50 or more hours a week",null,null,null,null,"Long term support: Prison","Community supported living",null,null,"Unplanned: Hospital (planned and unplanned episodes)",null,null,null,"Hourly",null,null,"Fortnightly",{"$f":"52.14/2","v":26.07},"2021/22, Q1","2021-04-01","2021-06-30","2022-03-31",null,6,"0-18"]
[null,null,null,null,null,null,null,null,null,"Black, Black British, Caribbean or African: African",null,null,null,"Sensory support: Support for hearing impairment",null,"Owner occupier or shared ownership scheme","Paid: Less than 16 hours a week",null,null,null,"Unknown",null,null,null,null,null,null,null,"NFA: Other","Prison",null,null,null,null,null,null,null,null,"Long term support: Residential care","Day support",null,null,"Unplanned: Other reason",null,null,null,"Monthly",null,null,"4-weekly",{"$f":"52.14/4","v":13.035},"2021/22, Q2","2021-04-01","2021-09-30","2022-03-31",null,7,"0-18"]
[null,null,null,null,null,null,null,null,null,"Black, Black British, Caribbean or African: Any other Black, Black British or Caribbean background",null,null,null,"Sensory support: Support for visual impairment",null,"Placed in temporary accommodation by the council (inc. homelessness resettlement)","Unknown",null,null,null,null,null,null,null,null,null,null,null,"NFA: Referral to NHS services or NHS funded social care","Self-funder",null,null,null,null,null,null,null,null,"Short term support: Ongoing low level","Direct payment",null,null,"Unplanned: Provider failure",null,null,null,"One-off",null,null,"Monthly",12,"2021/22, Q3","2021-04-01","2021-12-31","2022-03-31",null,8,"0-18"]
{"$rows_left_out":133}
{"sheet":"Change Log","index":7,"n_rows":16,"n_cols":4,"rows_kept":16,"cut":false,"hidden":false,"merged":[]}
[]
[null,"Adult Social Care Client Level Data Validation Tool - Release 2 Change Log"]
[null,"Date","Version","Comment"]
[null,"2025-08-28","v2.00","Initial release."]
[null,"2025-09-04","v2.01","Correction to lookup values:\n  - Hearing impairment: Severity unknown\n  - Visual impairment: Severity unknown\n  - Unpaid carer support: Support involving the person cared-for"]
[null,"2025-09-08","v2.02","Correction to lookup values:\n  - Planned transition from children's services\n  - Home support or domiciliary care\n"]
[null,"2025-09-23","v2.03","Added lookup value for Review_Outcomes_Acheived:\n  - Not applicable\n"]
[null,"2025-09-26","v2.04","Total Hrs Caring per week updated to reflect updated Release 2 lookup value mappings, released May 2025."]
[null,"2025-09-26","v2.05","Validate macro adjusted to account for the two data columns removed since Release 1."]
[null,"2025-10-09","v2.06","Apostrophe changed in lookup values, Summary counts tab wording amendment from \"Home support\"\n"]
{"$rows_left_out":7}
{"sheet":"Formula","index":8,"n_rows":82,"n_cols":14,"rows_kept":82,"cut":false,"hidden":true,"merged":[[20,0,20,12]]}
["Specification","Guidance document"]
[null,"Event Outcome","Request","Assmt","Service","Review","spec defined list matches guidance doc."]
["Progress to Reablement/ST-Max","Progress to Reablement / ST-Max","PN+E","PN+E",null,"PE",{"$f":"IF(A3=B3,\"match\",\"not match\")","v":"not match"}]
["Progress to Assessment / Unplanned Review","Progress to Assessment / Unplanned Review","PN+E",null,null,null,"match"]
["Admitted to hospital","Admitted to Hospital",null,null,"PN+E",null,"match"]
["Progress to Re-assessment","Progress to re-assessment",null,null,null,"PN+E","match"]
["Progress to Support Planning / Services","Progress to Support Planning / Services*","PN","PN+E",null,null,"not match"]
["Progress to End of Life Care","Progress to End of Life Care","PN+E","PN+E","PN+E","PN+E","match"]
["No change in package","No change in package",null,null,null,"PN+E","match"]
["NFA - Deceased","NFA - Deceased","PN+E","PN+E","PN+E","PN+E","match"]
{"$rows_left_out":72}