{"text_format":"1","workbook":"xlsx","n_sheets":7,"sheets":["Instructions","Input sheet","Validate","Validation summary page","Summary counts","lists","Formula"],"not_rendered":{"charts":0,"images":1,"macros":1,"external_links":1,"defined_names":131,"comments":0,"pivot_tables":0},"unopened":[],"bounds":{"document_bytes":16777216,"sheet_cells":100000,"rows_first":2000,"rows_last":500,"rows_between":2000,"halvings":0,"cell_chars":16384,"cell_head_chars":4096},"cells_cut":0,"cells_raw":0,"read":"whole","date_system":"1900"}

{"sheet":"Instructions","index":0,"n_rows":30,"n_cols":10,"rows_kept":30,"cut":false,"hidden":false,"merged":[[18,5,18,6]]}
[]
[null,"Adult Social Care - Client Level Data Collection (ASC-CLD): Validation Tool"]
[]
[null,"The CLD Validation tool is experimental (beta) and we welcome all feedback for future development:",null,null,null,null,null,null,null,"agem.adultsocialcare@nhs.net"]
[]
[null,"Version:","BETA V1.1","2022-10-13"]
[null,"Please use this tool to help validate the CLD data before submission to the DSCRO."]
[]
[]
[null,"HOW TO: Steps to validate"]
{"$rows_left_out":21}
{"sheet":"Input sheet","index":1,"n_rows":11,"n_cols":54,"rows_kept":11,"cut":false,"hidden":false,"merged":[[7,35,8,35],[7,46,8,46],[7,45,8,45],[7,26,8,26],[7,22,8,22],[7,29,8,29],[7,30,8,30],[7,34,8,34],[7,0,8,0],[0,0,0,4],[7,24,8,24],[5,0,5,2],[7,23,8,23],[7,12,8,12],[7,13,8,13],[7,14,8,14],[7,8,8,8],[7,9,8,9],[7,10,8,10],[7,11,8,11],[7,5,8,5],[7,7,8,7],[7,15,8,15],[7,16,8,16],[6,50,7,50],[7,51,7,53],[7,4,8,4],[7,17,8,17],[7,27,8,27],[7,28,8,28],[7,33,8,33],[7,31,8,31],[7,32,8,32],[7,40,8,40],[7,41,8,41],[7,36,8,36],[7,37,8,37],[7,38,8,38],[7,18,8,18],[7,19,8,19],[2,1,2,3],[3,1,3,3],[7,1,8,1],[7,2,8,2],[7,6,8,6],[7,3,8,3],[7,47,8,47],[7,48,8,48],[7,49,8,49],[5,3,5,22],[5,24,5,29],[5,39,5,43],[5,47,5,49],[7,20,8,20],[7,21,8,21],[7,42,8,42],[7,43,8,43],[7,44,8,44],[7,25,8,25],[5,44,5,46],[5,31,5,33],[7,39,8,39]]}
["Adult Social Care - Client Level Data (CLD) - INPUT SHEET",null,null,null,null,null,"Spec Version","Release 1"]
[null,"Mandatory","Voluntary","Remove?",null,null,null,"*"]
["Summary:","Count of total data items"]
[null,{"$f":"COUNTIF(A8:AX8,\"*\")","v":50}]
[null,"IMPORTANT: Cells highlighted red contain the validation formula (columns AY:BB) - DO NOT DELETE"]
["Submission Information",null,null,"Person Details - Present on ALL rows with unique values for each data item repeated for all events relating to a person (NOT event specific)",null,null,null,null,null,null,null,null,null,null,null,null,null,null,null,null,null,null,null,null,"Events (All)",null,null,null,null,null,"Events (Requests only)","Events (Assessments only)",null,null,"Carers and linked service users (Carers only)",null,null,null,null,"Events (Services only)",null,null,null,null,"Events (Reviews only)",null,null,"Costs (Services Only)"]
["Mandatory","Mandatory","Mandatory","Mandatory","Mandatory","Mandatory","Mandatory","Voluntary","Voluntary","Mandatory","Mandatory","Mandatory","Mandatory","Mandatory","Mandatory","Mandatory","Mandatory","Mandatory","Voluntary","Voluntary","Voluntary","Voluntary","Mandatory","Voluntary","Mandatory","Mandatory","Voluntary","Mandatory","Mandatory","Mandatory","Voluntary","Voluntary","Mandatory","Mandatory","Voluntary","Voluntary","Mandatory","Voluntary","Voluntary","Voluntary","Voluntary","Voluntary",null,null,null,null,"Mandatory",null,null,null,"Auto populated"]
["LA Code ","Reporting Period Start Date","Reporting Period End Date","NHS Number","LA Person Unique Identifier","First Name","Last Name","GP Practice Name","GP Practice Code","Gender","Ethnicity","Date of Birth","Date of Death","Client Type","Primary Support Reason","Postcode","Accommodation Status","Employment Status","Has Informal Carer","Autism Spectrum Disorder (ASD)","Visual Impairment","Hearing Impairment","Dementia","Client Funding Status","Event Type","Event Reference","Event Start Date","Event End Date","Event Description","Event Outcome","Request: Route of Access","Assessment Type","Eligible Needs Identified","Method of Assessment","Total Hrs Caring per week","No. of adults being cared for","Adult 1 Linked Person_ID","Adult 2 Linked Person_ID","Adult 3 Linked Person_ID","Service Type","Service Component","Delivery Mechanism","Provider CQC Location Name","Provider CQC Location ID","Review Reason","Review Outcomes Achieved","Method of Review","Unit Cost","Cost Frequency (Unit Type)","Planned units per week",null,"Do not remove"]
[null,null,null,null,null,null,null,null,null,null,null,null,null,null,null,null,null,null,null,null,null,null,null,null,null,null,null,null,null,null,null,null,null,null,null,null,null,null,null,null,null,null,null,null,null,null,null,null,null,null,"Planned cost\nfull year\n\nSubmission year","Commitment dates"]
["Integer","dd/mm/yyyy","dd/mm/yyyy","Integer ","Integer or Alpha-numeric","Text","Text","Text","Alpha-numeric","Defined List…","Defined List…","dd/mm/yyyy","dd/mm/yyyy","Defined List","Defined List…","Alpha-numeric","Defined List…","Defined List…","Defined List…","Defined List…","Defined List","Defined List","Defined List…","Defined List…","Defined List…","Integer or Alpha-numeric","dd/mm/yyyy","dd/mm/yyyy","Text","Defined List…","Defined List…","Defined List…","Defined List…","Defined List…","Defined List","Integer","Integer or Alpha-numeric","Integer or Alpha-numeric","Integer or Alpha-numeric","Defined List…","Defined List…","Defined List…","Alpha-numeric","Alpha-numeric","Defined List…","Defined List…","Defined List…","Numeric (0.00)","Defined List…","Numeric (0.00)","Year","start","end","wks"]
{"$rows_left_out":2}
{"sheet":"Validate","index":2,"n_rows":11,"n_cols":108,"rows_kept":11,"cut":false,"hidden":false,"merged":[[6,47,6,49],[6,0,6,2],[0,0,0,4],[6,3,6,22],[6,24,6,29],[6,39,6,43],[6,31,6,33],[6,44,6,46]]}
["Adult Social Care - Client Level Data (CLD) - VALIDATE",null,null,null,null,null,"Spec Version","Release 1"]
[]
[]
[]
[]
[null,"IMPORTANT: Cells highlighted red contain the validation formula (row 11) - DO NOT DELETE "]
["Submission Information",null,null,"Person Details - Present on ALL rows with unique values for each data item repeated for all events relating to a person (NOT event specific)",null,null,null,null,null,null,null,null,null,null,null,null,null,null,null,null,null,null,null,null,"Events (All)",null,null,null,null,null,"Events (Requests only)","Events (Assessments only)",null,null,"Carers and linked service users (Carers only)",null,null,null,null,"Events (Services only)",null,null,null,null,"Events (Reviews only)",null,null,"Costs (Services Only)"]
["Mandatory","Mandatory","Mandatory","Mandatory","Mandatory","Mandatory","Mandatory","Voluntary","Voluntary","Mandatory","Mandatory","Mandatory","Mandatory","Mandatory","Mandatory","Mandatory","Mandatory","Mandatory","Voluntary","Voluntary","Voluntary","Voluntary","Mandatory","Voluntary","Mandatory","Mandatory","Voluntary","Mandatory","Mandatory","Mandatory","Voluntary","Voluntary","Mandatory","Mandatory","Voluntary","Voluntary","Mandatory","Voluntary","Voluntary","Voluntary","Voluntary",null,null,null,null,null,"Mandatory",null,null,"Voluntary"]
[null,null,null,null,null,null,null,null,null,null,null,null,null,null,null,null,null,null,null,null,null,null,null,null,null,null,null,null,null,null,null,null,null,null,null,null,null,null,null,null,null,null,null,null,null,null,null,null,null,null,null,"LA Code ","Reporting Period Start Date","Reporting Period End Date","NHS Number","LA Person Unique Identifier","First Name","Last Name","GP Practice Name","GP Practice Code","Gender","Ethnicity","Date of Birth","Date of Death","Client Type","Primary Support Reason","Postcode","Accommodation Status","Employment Status","Has Informal Carer","Autism Spectrum Disorder (ASD)","Visual Impairment","Hearing Impairment","Dementia","Client Funding Status","Event Type","Event Reference","Event Start Date","Event End Date","Event Description","Event Outcome","Request: Route of Access","Assessment Type","Eligible Needs Identified","Method of Assessment","Total Hrs Caring per week","No. of adults being cared for","Adult 1 Linked Person_ID","Adult 2 Linked Person_ID","Adult 3 Linked Person_ID","Service Type","Service Component","Delivery Mechanism","Provider CQC Location Name","Provider CQC Location ID","Review Reason","Review Outcomes Achieved","Method of Review","Unit Cost","Cost Frequency (Unit Type)","Planned units per week"]
["LA Code ","Reporting Period Start Date","Reporting Period End Date","NHS Number","LA Person Unique Identifier","First Name","Last Name","GP Practice Name","GP Practice Code","Gender","Ethnicity","Date of Birth","Date of Death","Client Type","Primary Support Reason","Postcode","Accommodation Status","Employment Status","Has Informal Carer","Autism Spectrum Disorder (ASD)","Visual Impairment","Hearing Impairment","Dementia","Client Funding Status","Event Type","Event Reference","Event Start Date","Event End Date","Event Description","Event Outcome","Request: Route of Access","Assessment Type","Eligible Needs Identified","Method of Assessment","Total Hrs Caring per week","No. of adults being cared for","Adult 1 Linked Person_ID","Adult 2 Linked Person_ID","Adult 3 Linked Person_ID","Service Type","Service Component","Delivery Mechanism","Provider CQC Location Name","Provider CQC Location ID","Review Reason","Review Outcomes Achieved","Method of Review","Unit Cost","Cost Frequency (Unit Type)","Planned units per week",null,"Column A","Column B","Column  C","Column  D","Column  E","Column F","Column G","Column H","Column I","Column J","Column K","Column L","Column M","Column N","Column O","Column P","Column Q","Column R","Column S","Column T","Column U","Column V","Column W","Column X","Column Y","Column Z","Column AA","Column AB","Column AC","Column AD","Column AE","Column AF","Column AG","Column AH","Column AI","Column AJ","Column AK","Column AL","Column AM","Column AN","Column AO","Column AP","Column AQ","Column AR","Column AS","Column AT","Column AU","Column AV","Column AW","Column AX",null,"Age\n\nat end date of reporting period","Age Band\n\non end date of event","LTS005","Event active during submission period","Row Validated = P\nELSE\nValidation count","Acceptable by DLP"]
{"$rows_left_out":2}
{"sheet":"Validation summary page","index":3,"n_rows":114,"n_cols":8,"rows_kept":114,"cut":false,"hidden":false,"merged":[[2,1,2,6],[15,1,15,6],[0,0,0,6],[5,1,5,7]]}
["Adult Social Care - Client Level Data (CLD): Validation Summary"]
[]
[null,"Validation rules apply for to both mandatory and voluntary data items that LAs have supplied data for."]
[null,"If LAs have not supplied data for the voluntary data items then the validation rules will not apply."]
[]
[null,"Summary of all primary validation rules"]
[]
[null,"Validation Type","No. of validation  rules","No. of items\ntriggered"]
[null,"Missing Value",{"$f":"COUNTIF(E:E,B9)","v":33},{"$f":"SUM(G19:G51)","v":0},{"$f":"IF(Validate!$A$11=\"\",\"\",IF(D9=0,\"PASS\",\"CHECK\"))","v":""},"Total rows that have passed validation",{"$f":"COUNTIF(Validate!DC:DC,\"P\")","v":0},"P"]
[null,"Unexpected Value",{"$f":"COUNTIF(E:E,B10)","v":43},{"$f":"SUM(G52:G94)","v":0},{"$f":"IF(Validate!$A$11=\"\",\"\",IF(D10=0,\"PASS\",\"CHECK\"))","v":""},"Total rows with at least one validation rule triggered",{"$f":"COUNTIF(Validate!DC:DC,\">=1\")","v":0},1]
{"$rows_left_out":105}
{"sheet":"Summary counts","index":4,"n_rows":66,"n_cols":6,"rows_kept":66,"cut":false,"hidden":false,"merged":[[0,0,0,6],[3,6,3,8]]}
["Adult Social Care - Client Level Data (CLD): Summary counts"]
[]
[]
[]
[]
[]
[null,null,"Count of events\nby Event Type"]
[null,null,"Request",{"$f":"COUNTIF('Input sheet'!Y11:Y50493,C8)","v":0}]
[null,null,"Assessment",{"$f":"COUNTIF('Input sheet'!Y11:Y50493,C9)","v":0}]
[null,null,"Service",{"$f":"COUNTIF('Input sheet'!Y11:Y50493,C10)","v":0}]
{"$rows_left_out":57}
{"sheet":"lists","index":5,"n_rows":142,"n_cols":60,"rows_kept":142,"cut":false,"hidden":true,"merged":[[0,49,1,49],[1,51,1,55],[0,43,1,43],[0,44,1,44],[0,45,1,45],[0,47,1,47],[0,48,1,48],[0,13,1,13],[0,9,1,9],[0,10,1,10],[0,19,1,19],[0,20,1,20],[0,18,1,18],[0,14,1,14],[0,15,1,15],[0,16,1,16],[0,17,1,17],[0,5,1,5],[0,0,1,0],[0,1,1,1],[0,2,1,2],[0,3,1,3],[0,4,1,4],[0,6,1,6],[0,7,1,7],[0,8,1,8],[0,11,1,11],[0,12,1,12],[0,21,1,21],[0,22,1,22],[0,39,1,39],[0,40,1,40],[0,41,1,41],[0,33,1,33],[0,23,1,23],[0,24,1,24],[0,25,1,25],[0,26,1,26],[0,27,1,27],[0,28,1,28],[0,29,1,29],[0,30,1,30],[0,31,1,31],[0,32,1,32],[0,42,1,42],[0,46,1,46],[0,34,1,34],[0,35,1,35],[0,36,1,36],[0,37,1,37],[0,38,1,38]]}
["LA Code ","Reporting Period Start Date","Reporting Period End Date","NHS Number","LA Person Unique Identifier","First Name","Last Name","GP Practice Name","GP Practice Code","Gender","Ethnicity","Date of Birth","Date of Death","Client Type","Primary Support Reason","Postcode","Accommodation Status","Employment Status","Has Informal Carer","Autism Spectrum Disorder (ASD)","Visual Impairment","Hearing Impairment","Dementia","Client Funding Status","Event Type","Event Reference","Event Start Date","Event End Date","Event Description","Event Outcome","Request: Route of Access","Assessment Type","Eligible Needs Identified","Method of Assessment","Total Hrs Caring per week","No. of adults being cared for","Adult 1 Linked Person_ID","Adult 2 Linked Person_ID","Adult 3 Linked Person_ID","Service Type","Service Component","Delivery Mechanism","Provider CQC Location Name","Provider CQC Location ID","Review Reason","Review Outcomes Achieved","Method of Review","Unit Cost","Cost Frequency (Unit Type)","Planned units per week",null,null,null,null,null,null,null,null,"Age","Age Band"]
[null,null,null,null,null,null,null,null,null,null,null,null,null,null,null,null,null,null,null,null,null,null,null,null,null,null,null,null,null,null,null,null,null,null,null,null,null,null,null,null,null,null,null,null,null,null,null,null,null,null,null,"Do not move",null,null,null,null,null,null,0,"0-18"]
["Integer","dd/mm/yyyy","dd/mm/yyyy","Integer ","Integer or Alpha-numeric","Text","Text","Text","Alpha-numeric","Defined List…","Defined List…","dd/mm/yyyy","dd/mm/yyyy","Defined List","Defined List…","Alpha-numeric","Defined List…","Defined List…","Defined List…","Defined List…","Defined List","Defined List","Defined List…","Defined List…","Defined List…","Integer or Alpha-numeric","dd/mm/yyyy","dd/mm/yyyy","Text","Defined List…","Defined List…","Defined List…","Defined List…","Defined List…","Defined List","Integer","Integer or Alpha-numeric","Integer or Alpha-numeric","Integer or Alpha-numeric","Defined List…","Defined List…","Defined List…","Alpha-numeric","Alpha-numeric","Defined List…","Defined List…","Defined List…","Numeric (0.00)","Defined List…","Numeric (0.00)",null,"Cost Frequency","Cost frequency fraction",null,"Start Date  Reporting Period","End Date Reporting Period","End Date Reporting Year",null,1,"0-18"]
[null,null,null,null,null,null,null,null,null,"Female","White - British",null,null,"Service User","Physical Support: Access & mobility only","Unknown","Owner occupier or shared ownership scheme","Paid: Less than 16 hours a week","Yes","Yes","Blind/severely sight impaired","Deaf with speech","Yes","18(3) (full cost client)","Request",null,null,null,null,"Progress to Reablement/ST-Max","Planned Entry (Transition)","Short Term Assessment","Eligible needs identified","Carer only","1 - 7 hrs",null,null,null,null,"Short Term Support: ST-Max","Reablement","Direct Payment",null,null,"Planned","Fully Met","Carer only",null,"Per Session",null,null,"Defined List…",null,"2020/21, Q1","2020-04-01","2020-06-30","2021-03-31",null,2,"0-18"]
[null,null,null,null,null,null,null,null,null,"Male","White - Irish",null,null,"Carer","Physical Support: Personal care support",null,"Tenant","Paid: 16 or more hours a week","No","No","Partial sight/sight impaired","Deaf without speech","No","Self-Funder – Metering Only","Assessment",null,null,null,null,"Progress to Assessment","Discharge from Hospital","Long Term Assessment","Non-eligible needs identified","Service user only","8 - 14 hrs",null,null,null,null,"Short Term Support: Ongoing Low Level","Short Term Nursing Care","CASSR Managed Personal Budget",null,null,"Unplanned - Hospital (Planned and unplanned episodes)","Partially Met","Service user only",null,"Hourly",null,null,"Per Session",52.14,"2020/21, Q2","2020-04-01","2020-09-30","2021-03-31",null,3,"0-18"]
[null,null,null,null,null,null,null,null,null,"Other","White - Any other White background",null,null,"Carer known by association","Sensory Support: Support for visual impairment",null,"Tenant - private landlord","Not in Paid Employment (seeking work)","Unknown","Unknown","No visual impairment","Hard of hearing","Unknown","Joint Client and Social Care Funded","Service",null,null,null,null,"Admitted to hospital","Diversion from Hospital Services","Financial Assessment","No needs identified","Service user and carer","15 - 21 hrs",null,null,null,null,"Short Term Support: Other Short Term","Short Term Residential Care","CASSR Commissioned Support",null,null,"Unplanned - Carer related","Not Met","Service user and carer",null,"Daily",null,null,"Hourly",52.14,"2020/21, Q3","2020-04-01","2020-12-31","2021-03-31",null,4,"0-18"]
[null,null,null,null,null,null,null,null,null,"Unknown","Mixed - White and Black Caribbean",null,null,"Unknown","Sensory Support: Support for hearing impairment",null,"Settled mainstream housing with family / friends","Not in Paid Employment (not actively seeking work / retired)",null,null,"Visual impairment - severity unknown","No hearing impairment",null,"Fully Health Funded","Review",null,null,null,null,"Progress to Re-assessment / Unplanned Review","Community / Other route",null,null,null,"22 - 28 hrs",null,null,null,null,"Long Term Support: Nursing Care","Long Term Nursing Care","Self-Funder Metering Only",null,null,"Unplanned - Safeguarding concern",null,null,null,"Weekly",null,null,"Weekly",52.14,"2020/21,Q4","2020-04-01","2021-03-31","2021-03-31",null,5,"0-18"]
[null,null,null,null,null,null,null,null,null,null,"Mixed - White and Black African",null,null,null,"Sensory Support: Support for dual impairment",null,"Supported accommodation / supported lodgings / supported group home","Not in Paid Employment (voluntary work only)",null,null,"Unknown","Hearing impairment - severity unknown",null,"Joint Health and Social Care Funded",null,null,null,null,null,"Progress to Support Planning / Services","Prison",null,null,null,"29 - 35 hrs",null,null,null,null,"Long Term Support: Residential Care","Long Term Residential Care",null,null,null,"Unplanned - Other Reason",null,null,null,"Fortnightly",null,null,"Fortnightly",{"$f":"52.14/2","v":26.07},"2021/22, Q1","2021-04-01","2021-06-30","2022-03-31",null,6,"0-18"]
[null,null,null,null,null,null,null,null,null,null,"Mixed - White and Asian",null,null,null,"Support with Memory & Cognition",null,"Shared Lives scheme","Paid: Hours per week unknown",null,null,null,"Unknown",null,"Fully Social Care Funded",null,null,null,null,null,"Progress to End of Life Care","Self-Funder ",null,null,null,"36 - 42 hrs",null,null,null,null,"Long Term Support: Community","Home Support",null,null,null,"Unplanned - Provider Failure",null,null,null,"4-weekly",null,null,"4-weekly",{"$f":"52.14/4","v":13.035},"2021/22, Q2","2021-04-01","2021-09-30","2022-03-31",null,7,"0-18"]
[null,null,null,null,null,null,null,null,null,null,"Mixed - Any other mixed background",null,null,null,"Learning Disability Support",null,"Approved premises for offenders released from prison or under probation supervision","Unknown",null,null,null,null,null,"Unknown - System Level",null,null,null,null,null,"No change in package","Discharge from Reablement",null,null,null,"43 - 49 hrs",null,null,null,null,"Long Term Support: Prison","Day Support",null,null,null,"Unplanned - Change in Commissioning arrangements",null,null,null,"Monthly",null,null,"Monthly",12,"2021/22, Q3","2021-04-01","2021-12-31","2022-03-31",null,8,"0-18"]
{"$rows_left_out":133}
{"sheet":"Formula","index":6,"n_rows":82,"n_cols":14,"rows_kept":82,"cut":false,"hidden":true,"merged":[[20,0,20,12]]}
["Specification","Guidance document"]
[null,"Event Outcome","Request","Assmt","Service","Review","spec defined list matches guidance doc."]
["Progress to Reablement/ST-Max","Progress to Reablement / ST-Max","PN+E","PN+E",null,"PE",{"$f":"IF(A3=B3,\"match\",\"not match\")","v":"not match"}]
["Progress to Assessment / Unplanned Review","Progress to Assessment / Unplanned Review","PN+E",null,null,null,"match"]
["Admitted to hospital","Admitted to Hospital",null,null,"PN+E",null,"match"]
["Progress to Re-assessment","Progress to re-assessment",null,null,null,"PN+E","match"]
["Progress to Support Planning / Services","Progress to Support Planning / Services*","PN","PN+E",null,null,"not match"]
["Progress to End of Life Care","Progress to End of Life Care","PN+E","PN+E","PN+E","PN+E","match"]
["No change in package","No change in package",null,null,null,"PN+E","match"]
["NFA - Deceased","NFA - Deceased","PN+E","PN+E","PN+E","PN+E","match"]
{"$rows_left_out":72}